{"text_format":"1","workbook":"xlsx","n_sheets":7,"sheets":["Interfaz","Poblacion","etapas y mredes","Etapas de Vida","Piramide Poblacional","Demografia","Pobla_EESS"],"not_rendered":{"charts":7,"images":19,"macros":1,"external_links":1,"defined_names":42,"comments":1,"pivot_tables":0},"unopened":[],"bounds":{"document_bytes":16777216,"sheet_cells":100000,"rows_first":2000,"rows_last":500,"rows_between":2000,"halvings":0,"cell_chars":16384,"cell_head_chars":4096},"cells_cut":0,"cells_raw":0,"read":"whole","date_system":"1900"}

{"sheet":"Interfaz","index":0,"n_rows":27,"n_cols":18,"rows_kept":27,"cut":false,"hidden":false,"merged":[[4,2,7,11],[9,2,11,11]]}
[]
[]
[]
[]
[null,null,"POBLACIÓN ASIGNADA 2025 SEGÚN CENSOS INEI - RENIEC - PN - CNV"]
[]
[]
[]
[]
[null,null,"RED INTEGRADA DE SALUD HUAURA OYÓN"]
{"$rows_left_out":18}
{"sheet":"Poblacion","index":1,"n_rows":94,"n_cols":127,"rows_kept":94,"cut":false,"hidden":false,"merged":[[4,74,4,75],[5,74,5,75],[5,78,5,79],[4,84,6,84],[4,119,5,120],[4,121,5,122],[4,123,5,124],[4,125,5,126],[3,117,3,126],[4,118,6,118],[4,117,6,117],[5,104,6,104],[4,104,4,109],[4,111,4,115],[5,111,5,112],[5,113,6,113],[5,114,6,114],[5,115,6,115],[5,109,6,109],[5,108,6,108],[5,107,6,107],[5,106,6,106],[5,105,6,105],[5,76,5,77],[2,91,2,98],[4,98,6,98],[4,97,6,97],[4,96,6,96],[4,91,6,91],[4,92,6,92],[4,93,6,93],[4,95,6,95],[4,94,6,94],[4,100,6,100],[4,101,6,101],[4,102,6,102],[4,85,6,85],[4,86,5,88],[4,89,6,89],[4,79,4,83],[5,80,5,81],[5,82,5,83],[4,76,4,77],[5,72,5,73],[5,62,5,63],[4,64,4,65],[5,64,5,65],[4,66,4,67],[5,60,5,61],[5,44,5,45],[5,46,5,47],[5,48,5,49],[5,50,5,51],[4,50,4,51],[4,48,4,49],[4,58,4,59],[5,66,5,67],[5,58,5,59],[4,56,4,57],[5,56,5,57],[4,72,4,73],[4,60,4,61],[4,62,4,63],[4,68,4,69],[5,68,5,69],[4,70,4,71],[5,70,5,71],[5,36,5,37],[4,52,4,53],[4,54,4,55],[5,52,5,53],[5,54,5,55],[1,18,1,43],[2,18,2,43],[4,36,4,37],[4,26,4,27],[3,18,3,43],[4,24,4,25],[5,24,5,25],[4,34,4,35],[4,16,4,17],[4,18,4,19],[5,16,5,17],[5,18,5,19],[4,20,4,21],[5,20,5,21],[4,22,4,23],[5,22,5,23],[4,28,4,29],[4,5,6,5],[4,44,4,45],[4,46,4,47],[4,7,6,7],[4,8,6,8],[5,28,5,29],[4,30,4,31],[5,30,5,31],[4,32,4,33],[5,32,5,33],[4,38,4,39],[5,38,5,39],[4,40,4,41],[5,40,5,41],[4,42,4,43],[5,42,5,43],[5,26,5,27],[5,34,5,35],[4,10,4,11],[5,10,5,11],[4,12,4,13],[5,12,5,13],[4,14,4,15],[5,14,5,15]]}
[null,null,1,2,3,4,5,6,7,8,9,10,11,12,13,14,15,16,17,18,19,20,21,22,23,24,25,26,27,28,29,30,31,32,33,34,35,36,37,38,39,40,41,42,43,44,45,46,47,48,49,50,51,52,53,54,55,56,57,58,59,60,61,62,63,64,65,66,67,68,69,70,71,72,73,74,75,76,77,78,79,80,81,82,83,84,85,86,87,88,89,90,91,92,93,94,95,96,97,98,99,100,101,102,103,104,105,106,107,108,109,110,111,112,113,114,115,116,117,118,119,120,121,122,123,124,125]
[null,null,null,null,null,null,null,null,null,null,null,null,null,null,null,null,null,null,"POBLACIÓN ESTIMADA POR GRUPOS DE EDAD, SEGÚN PROVINCIAS DISTRITOS Y ESTABLECIMIENTOS DE SALUD"]
[null,null,null,null,null,null,null,null,null,null,null,null,null,null,null,null,null,null,"RED INTEGRADA DE SALUD HUAURA OYON   -   AÑO  2025",null,null,null,null,null,null,null,null,null,null,null,null,null,null,null,null,null,null,null,null,null,null,null,null,null,null,null,null,null,null,null,null,null,null,null,null,null,null,null,null,null,null,null,null,null,null,null,null,null,null,null,null,null,null,null,null,null,null,null,null,null,null,null,null,null,null,null,null,null,null,null,null,"MAS GRUPOS DE EDAD"]
[null,null,null,null,null,null,null,null,null,null,null,null,null,null,null,null,null,null,"EDADES PUNTUALES Y GRUPOS DE EDAD",null,null,null,null,null,null,null,null,null,null,null,null,null,null,null,null,null,null,null,null,null,null,null,null,null,null,null,null,null,null,null,null,null,null,null,null,null,null,null,null,null,null,null,null,null,null,null,null,null,null,null,null,null,null,null,null,null,null,null,null,null,null,null,null,null,null,null,null,null,null,null,null,null,null,null,null,null,null,null,null,null,null,null,null,null,null,null,null,null,null,null,null,null,null,null,null,null,null,"Varones"]
[null,null,"N°",null,"DIRECCION DE SALUD","TOTAL GENERAL",null,"TOTAL MASCULINO","TOTAL FEMENINO",null,"EDAD",null,"EDAD",null,"EDAD",null,"EDAD",null,"EDAD",null,"EDAD",null,"EDAD",null,"EDAD",null,"EDAD",null,"EDAD",null,"EDAD",null,"EDAD",null,"EDAD",null,"EDAD",null,"EDAD",null,"EDAD",null,"EDAD",null,"EDAD",null,"EDAD",null,"EDAD",null,"EDAD",null,"EDAD",null,"EDAD",null,"EDAD",null,"EDAD",null,"EDAD",null,"EDAD",null,"EDAD",null,"EDAD",null,"EDAD",null,"EDAD",null,"EDAD",null,"EDAD",null,"EDAD",null,null,"EDADES ESPECIALES",null,null,null,null,"NACIMIENTOS","POBLACION FEMENINA TOTAL","POBLACION FEMENINA",null,null,"GESTANTES  ESPERADAS",null,"menor de 1 Año","Pre escolar         (1-4)","Niño             (0 - 11)","Escolar               (05 - 17)","Adolescente (12 - 17)","Adulto Joven (18 - 29)","Adulto            (30-59)","Adu.Mayor (60 a MAS)",null,"Escolar\n (05 - 09)","Adolescente (10 - 19)","Adulto \n(20-59)",null,"Poblacion: PADRON NOMINAL al 31_12_2023",null,null,null,null,null,null,"OTROS GRUPOS ESPECIALES (CONVENIO)",null,null,null,null,null,"Población Hombres Adolescentes               (14 -17 años)","Población Hombres (18 - 59 años)","(0 -13 años)",null,"(14 -17 años)",null,"(18 -59 años)",null,"(60 años a màs)"]
["UBIGEO",null,null,null,"PROVINCIA",null,null,null,null,null,0,null,1,null,2,null,3,null,4,null,5,null,6,null,7,null,8,null,9,null,10,null,11,null,12,null,13,null,14,null,15,null,16,null,17,null,18,null,19,null,"20 - 24 ",null,"25 - 29 ",null,"30 - 34 ",null,"35 - 39 ",null,"40 - 44 ",null,"45 - 49 ",null,"50 - 54 ",null,"55 - 59",null,"60 - 64 ",null,"65 - 69",null,"70 - 74",null,"75 - 79 ",null,"80 - 84",null,"85 y ++",null,"28 DIAS",null,"0-5 MESES",null,"6-11 MESES",null,null,null,null,null,null,null,null,null,null,null,null,null,null,null,null,null,null,null,null,null,"0A","1A","2A","3A","4A","5A",null,"25 - 64 (Cancer)",null,"50 - 64 (PAP)","30 - 49 (IVVA)","15 - 49 (MEF)"]
[null,"Microredes",null,"RENAES","DISTRITO",null,null,null,null,null,"M","F","M","F","M","F","M","F","M","F","M","F","M","F","M","F","M","F","M","F","M","F","M","F","M","F","M","F","M","F","M","F","M","F","M","F","M","F","M","F","M","F","M","F","M","F","M","F","M","F","M","F","M","F","M","F","M","F","M","F","M","F","M","F","M","F","M","F","M","F","M","F","M","F",null,null," 10 - 14","15 - 19","20 - 49",null,null,null,null,null,null,null,null,null,null,null,null,null,null,null,null,null,null,null,null,null,null,"M","F",null,null,null,null,null,null,"M","F","M","F","M","F","M","F"]
[150000,null,1,null,"HUAURA - OYON",{"$f":"SUM(H8:I8)","v":292417},null,{"$f":"K8+M8+O8+Q8+S8+U8+W8+Y8+AA8+AC8+AE8+AG8+AI8+AK8+AM8+AO8+AQ8+AS8+AU8+AW8+AY8+BA8+BC8+BE8+BG8+BI8+BK8+BM8+BO8+BQ8+BS8+BU8+BW8+BY8","v":140430},151987,null,1806,1837,1687,1737,1801,1839,1905,1778,2067,1954,2078,2012,2116,2117,2183,2094,2130,2150,1815,1651,1778,1778,1855,1862,1913,1925,1908,1918,1757,1770,2107,2274,2071,2157,1984,2100,2018,2040,1893,2031,9097,10151,9680,12812,9715,11572,10039,10555,9821,10484,9474,10181,8617,9784,8271,8859,7335,7432,5583,6089,5039,5363,3902,3990,2637,2773,2348,2918,107,109,786,733,1020,1104,4875,151987,9253,10602,65755,8094,null,3643,14768,46030,51503,23884,49722,117372,55409,null,20346,39139,214521,null,3643,3424,3640,3683,4021,4090,null,72952,81679,26075,42792,76357,null,7919,78625,27042,26652,7919,8301,78625,88469,24207,25792]
[150800,null,2,150800,"PROVINCIA HUAURA",{"$f":"SUM(H9:I9)","v":274303},null,131706,142597,null,1679,1705,1591,1632,1706,1729,1807,1665,1956,1846,1939,1888,1988,1993,2053,1965,2010,2009,1690,1534,1646,1643,1720,1723,1758,1764,1763,1766,1629,1631,1932,2082,1908,1963,1826,1943,1865,1896,1764,1900,8511,9513,9115,12087,9170,10902,9452,9939,9288,9966,8908,9638,8093,9207,7784,8349,6865,6988,5240,5733,4719,5042,3664,3718,2477,2560,2190,2678,95,104,736,684,943,1021,4514,142597,8527,9784,62045,7622,null,3384,13932,43117,47766,21965,46651,110696,51874,null,19069,36122,201796,null,3384,3223,3435,3472,3802,3827,null,68675,77076,24544,40445,71829,null,7295,73950,25306,24862,7295,7619,73950,83397,22678,24159]
[150801,null,3,150802,"DISTRITO HUACHO",53280,null,25923,27357,null,206,221,212,220,256,253,247,230,291,277,332,311,362,348,379,326,377,373,325,297,305,292,301,287,316,302,321,306,293,281,351,362,352,343,342,337,371,325,330,321,1578,1626,1630,2134,1685,1955,1829,1800,1865,1933,1836,1923,1754,1932,1716,1810,1551,1591,1230,1323,1071,1218,805,841,606,610,498,649,20,22,102,101,104,120,498,27357,1468,1688,11371,1181,null,427,1986,7028,8521,3906,8315,22038,11993,null,3430,6438,40999,null,427,432,509,477,568,643,null,13866,15078,5333,7611,13059,null,1338,14594,4230,4043,1338,1323,14594,15759,5155,5622]
{"$rows_left_out":85}
{"sheet":"etapas y mredes","index":2,"n_rows":24,"n_cols":21,"rows_kept":24,"cut":false,"hidden":false,"merged":[[6,15,6,20],[6,2,6,11],[1,2,5,12]]}
[]
[null,null,"POBLACION ASIGNADA POR DISTRITO SIERRA, HOSPITAL, MICROREDES Y POR ETAPAS DE VIDA 2025"]
[]
[]
[]
[]
[null,null,"DISTRITO",null,null,null,null,null,null,null,null,null,null,null,null,"MICROREDES"]
[null,null,66,68,11,74,59,28,76,33,null,null,null,4,null,83,84,85,86,87]
[null,"POBLACION POR\nETAPAS DE VIDA","Andajes","Caujul","Checras","Naván","Oyón","Paccho","Pachangara","Santa Leonor","Total","PORC. (%)",null,"HOSPITAL HUACHO",null,"HUAURA","HUALMAY","SAYAN","VEGUETA","CHURIN OYON","Total Microredes"]
[77,"Neonatal (0-28dias)",0,1,0,0,7,0,2,0,10,5.0200803212851398E-2,null,0,null,16,55,12,14,10,107]
{"$rows_left_out":15}
{"sheet":"Etapas de Vida","index":3,"n_rows":34,"n_cols":6,"rows_kept":34,"cut":false,"hidden":false,"merged":[[1,2,1,4],[39,0,39,14]]}
[]
[]
[]
[]
[86]
[true]
[]
[15]
[]
[]
{"$rows_left_out":25}
{"sheet":"Piramide Poblacional","index":4,"n_rows":155,"n_cols":164,"rows_kept":155,"cut":false,"hidden":false,"merged":[[44,3,46,18],[29,44,29,46],[29,48,29,50],[10,90,10,91],[10,92,10,93],[10,94,10,95],[10,96,10,97],[130,144,130,145],[130,146,130,147],[130,117,130,118],[130,119,130,120],[130,121,130,122],[130,123,130,124],[130,125,130,126],[130,130,130,131],[130,105,130,106],[130,107,130,108],[130,109,130,110],[130,111,130,112],[130,113,130,114],[130,115,130,116],[129,91,131,91],[129,93,129,126],[129,128,131,128],[129,130,129,163],[130,93,130,94],[130,95,130,96],[130,97,130,98],[130,99,130,100],[130,101,130,102],[130,103,130,104],[130,156,130,157],[130,158,130,159],[130,160,130,161],[130,162,130,163],[130,148,130,149],[130,150,130,151],[130,152,130,153],[130,154,130,155],[130,132,130,133],[130,134,130,135],[130,136,130,137],[130,138,130,139],[130,140,130,141],[130,142,130,143],[119,17,119,18],[119,22,119,23],[119,27,119,28],[119,32,119,33],[119,37,119,38],[120,17,120,18],[120,22,120,23],[120,27,120,28],[120,32,120,33],[120,37,120,38],[117,17,117,18],[117,22,117,23],[117,27,117,28],[117,32,117,33],[117,37,117,38],[118,17,118,18],[118,22,118,23],[118,27,118,28],[118,32,118,33],[118,37,118,38],[115,17,115,18],[115,22,115,23],[115,27,115,28],[115,32,115,33],[115,37,115,38],[116,17,116,18],[116,22,116,23],[116,27,116,28],[116,32,116,33],[116,37,116,38],[113,17,113,18],[113,22,113,23],[113,27,113,28],[113,32,113,33],[113,37,113,38],[114,17,114,18],[114,22,114,23],[114,27,114,28],[114,32,114,33],[114,37,114,38],[111,17,111,18],[111,22,111,23],[111,27,111,28],[111,32,111,33],[111,37,111,38],[112,17,112,18],[112,22,112,23],[112,27,112,28],[112,32,112,33],[112,37,112,38],[109,17,109,18],[109,22,109,23],[109,27,109,28],[109,32,109,33],[109,37,109,38],[110,17,110,18],[110,22,110,23],[110,27,110,28],[110,32,110,33],[110,37,110,38],[107,17,107,18],[107,22,107,23],[107,27,107,28],[107,32,107,33],[107,37,107,38],[108,17,108,18],[108,22,108,23],[108,27,108,28],[108,32,108,33],[108,37,108,38],[105,17,105,18],[105,22,105,23],[105,27,105,28],[105,32,105,33],[105,37,105,38],[106,17,106,18],[106,22,106,23],[106,27,106,28],[106,32,106,33],[106,37,106,38],[103,32,103,33],[103,37,103,38],[103,42,103,43],[104,17,104,18],[104,22,104,23],[104,27,104,28],[104,32,104,33],[104,37,104,38],[102,152,102,153],[102,129,103,129],[102,130,102,131],[102,132,102,133],[102,134,102,135],[102,136,102,137],[102,138,102,139],[102,115,102,116],[102,117,102,118],[102,119,102,120],[102,121,102,122],[102,123,102,124],[102,125,102,126],[102,103,102,104],[102,105,102,106],[102,107,102,108],[102,154,102,155],[102,156,102,157],[102,158,102,159],[102,160,102,161],[102,162,102,163],[102,140,102,141],[102,142,102,143],[102,144,102,145],[102,146,102,147],[102,148,102,149],[102,150,102,151],[101,91,103,91],[101,92,101,126],[102,78,102,79],[102,80,102,81],[102,82,102,83],[102,84,102,85],[102,86,102,87],[102,88,102,89],[102,66,102,67],[102,68,102,69],[102,70,102,71],[102,72,102,73],[102,74,102,75],[102,76,102,77],[102,109,102,110],[102,111,102,112],[102,113,102,114],[102,92,103,92],[102,93,102,94],[102,95,102,96],[102,97,102,98],[102,99,102,100],[102,101,102,102],[101,128,103,128],[101,129,101,163],[102,17,102,18],[102,22,102,23],[102,27,102,28],[102,32,102,33],[102,37,102,38],[101,17,101,20],[101,22,101,25],[101,27,101,30],[101,32,101,35],[101,37,101,40],[101,54,103,54],[102,42,102,43],[103,17,103,18],[103,22,103,23],[103,27,103,28],[102,55,103,55],[102,56,102,57],[102,58,102,59],[102,60,102,61],[102,62,102,63],[102,64,102,65],[101,55,101,89],[10,55,11,55],[10,56,10,57],[10,58,10,59],[10,60,10,61],[10,62,10,63],[10,64,10,65],[4,4,4,7],[4,11,4,13],[9,44,9,46],[9,48,9,50],[9,55,9,89],[10,78,10,79],[10,80,10,81],[10,82,10,83],[10,84,10,85],[10,86,10,87],[10,88,10,89],[10,66,10,67],[10,68,10,69],[10,70,10,71],[10,72,10,73],[10,74,10,75],[10,76,10,77]]}
[]
[null,null,null,null,null,null,null,null,{"$f":"CONCATENATE(\"PIRAMIDE POBLACIONAL 2025\")","v":"PIRAMIDE POBLACIONAL 2025"},null,null,null,null,null,null,null,null,null,null,{"$f":"UPPER(\"Piramide Poblacional 2024 - \" &$B$10)","v":"PIRAMIDE POBLACIONAL 2024 - MICRORED VEGUETA"}]
[]
[]
[null,null,null,null,"ESTABLECIMIENTOS",null,null,null,null,null,null,null,null,null,null,null,null,null,null,null,null,null,null,null,null,null,null,null,null,null,null,null,null,null,null,null,null,null,null,null,null,null,null,null,null,null,null,null,null,"M","F"]
[]
[87,null,null,null,null,null,null,null,null,null,null,null,null,null,null,null,null,null,null,null,null,null,null,null,null,null,null,null,null,null,null,null,null,null,null,null,null,null,null,null,null,null,null,null,null,null,null,null,null,{"$f":"AX8/SUM($AX$8:$AY$8)","v":0.47724867724867726},{"$f":"AY8/SUM($AX$8:$AY$8)","v":0.52275132275132274}]
[null,null,null,null,null,null,null,null,null,null,null,null,null,null,null,null,null,null,null,null,null,null,null,null,null,null,null,null,null,null,null,null,null,null,null,null,null,null,null,null,null,null,null,null,null,null,null,null,null,{"$f":"SUM(AX12:AX28)","v":14432},{"$f":"SUM(AY12:AY28)","v":15808},null,null,1,2,3,4,5,6,7,8,9,10,11,12,13,14,15,16,17,18,19,20,21,22,23,24,25,26,27,28,29,30,31,32,33,34,35,36,37,38,39,40,41,42,43,44,45]
[]
[87,{"$f":"VLOOKUP($A$10,$BB$13:$BC$100,2,FALSE)","v":"MICRORED VEGUETA"},null,null,null,null,null,null,null,null,null,null,null,null,null,null,null,null,null,null,null,null,null,null,null,null,null,null,null,null,null,null,null,null,null,null,null,null,null,null,null,null,null,null,"DATOS PIRAMIDE",null,null,null,"DATOS PIRAMIDE",null,null,null,null,"N°","DIRECCION DE SALUD","GRUPOS DE EDADES  - PIRAMIDE"]
{"$rows_left_out":146}
{"sheet":"Demografia","index":5,"n_rows":26,"n_cols":14,"rows_kept":26,"cut":false,"hidden":false,"merged":[]}
[]
[null,null,null,null,null,null,"DATOS DEMOGRAFICOS - 2025"]
[null,null,null,null,null,null,"DENSIDAD POBLACIONAL POR DISTRITOS "]
[]
["VINCULOS","DISTRITOS","ALTITUD\n(m.s.n.m.)","LATITUD","LONGITUD","SUPERFICIE\n(Km2)","POBLACION",null,"DENSIDAD\nPOBLACIONAL"]
[null,"HUAURA",null,null,null,4892.5199999999995,{"$f":"+SUM(G7:G18)","v":275280},null,{"$f":"G6/F6","v":56.265482818670137},null,null,null,"XXX","DDD"]
[3,"HUACHO",30,"11º 06' 22''","77º 36' 24''",717.38,{"$f":"+LOOKUP($A$7,NUMERO,TOTAL)","v":53280},null,74.270261228358748,null,null,null,"PACHANGARA",{"$f":"VLOOKUP(M7,$B$7:$I$25,8,FALSE)","v":10.402697877405275}]
[6,"AMBAR",2082,"10º 45' 10''","77º 16' 19''",919.4,{"$f":"+LOOKUP(A8,NUMERO,TOTAL)","v":2841},null,3.0900587339569285,null,null,null,"OYÓN",9.0861854139603935]
[9,"CARQUIN",14,"10º 05' 21''","77º 37' 36''",2.04,9548,null,4680.3921568627447,null,null,null,"CAUJUL",4.218009478672986]
[11,"CHECRAS",3743,"10º 55' 54''","76º 49' 52''",166.37,1022,null,6.1429344232734264,null,null,null,"COCHAMARCA",4.485031067595556]
{"$rows_left_out":17}
{"sheet":"Pobla_EESS","index":6,"n_rows":61,"n_cols":16,"rows_kept":61,"cut":false,"hidden":false,"merged":[[32,3,32,5],[37,3,37,8],[37,10,37,15],[9,4,13,4],[9,11,11,11],[12,11,16,11],[16,3,16,5],[19,10,19,12],[52,11,55,11],[56,11,58,11],[59,10,59,12],[1,3,4,10],[7,3,7,8],[7,10,7,15],[15,3,15,4],[25,4,29,4],[25,11,30,11],[30,4,31,4],[23,3,23,8],[23,10,23,15],[31,10,31,12],[39,4,45,4],[39,11,41,11],[42,11,47,11]]}
[]
[null,null,null,"POBLACIÓN SEGÚN DISTRITOS Y EE.SS - 2025"]
[]
[]
[]
[]
[]
[null,null,null,"SIN MICRORED",null,null,null,null,null,null,"MICRORED HUALMAY"]
[null,null,null,"DISTRITO","POBLACIÓN","EE.SS","POBLACIÓN","MASCULINO","FEMENINO",null,"DISTRITO","POBLACIÓN","EE.SS","POBLACIÓN","MASCULINO","FEMENINO"]
[null,null,null,"HUACHO",{"$f":"G10","v":0},"HOSPITAL REGIONAL HUACHO",{"$f":"Poblacion!F11","v":0},{"$f":"Poblacion!H11","v":0},{"$f":"Poblacion!I11","v":0},null,"HUALMAY",{"$f":"SUM(N10:N12)","v":57016},"C.S. HUALMAY",{"$f":"VLOOKUP(M10,Poblacion!$E$5:$I$88,2,FALSE)","v":31021},{"$f":"VLOOKUP(M10,Poblacion!$E$5:$I$88,4,FALSE)","v":15027},{"$f":"VLOOKUP(M10,Poblacion!$E$5:$I$88,5,FALSE)","v":15994}]
{"$rows_left_out":51}